[mythtv-commits] Ticket #1785: compile error on x86_64 AMD

MythTV mythtv at cvs.mythtv.org
Mon May 8 13:11:01 EDT 2006


#1785: compile error on x86_64 AMD
--------------------------+-------------------------------------------------
 Reporter:  anonymous     |       Owner:  ijr    
     Type:  defect        |      Status:  new    
 Priority:  critical      |   Milestone:  unknown
Component:  mythcontrols  |     Version:  head   
 Severity:  high          |  
--------------------------+-------------------------------------------------
 make[1]: Entering directory `/usr/src/mythplugins/mythcontrols'
 cd mythcontrols && make -f Makefile
 make[2]: Entering directory
 `/usr/src/mythplugins/mythcontrols/mythcontrols'
 g++ -c -pipe -Wall -W -fomit-frame-pointer -D_REENTRANT -DPIC -fPIC
 -D_GNU_SOURCE -DPREFIX=\"\" -D_FILE_OFFSET_BITS=64 -DQT_NO_DEBUG
 -DQT_THREAD_SUPPORT -DQT_PLUGIN -DQT_SHARED
 -I/usr/lib64/qt-3.3/mkspecs/default -I. -I/include -I/usr/kde/3.3/include
 -I/include -I/usr/lib64/qt-3.3/include -o keybindings.o keybindings.cpp
 keybindings.cpp:33:32: error: mythtv/mythcontext.h: No such file or
 directory
 keybindings.cpp:34:32: error: mythtv/mythdialogs.h: No such file or
 directory
 In file included from keybindings.cpp:38:
 keybindings.h:27:30: error: mythtv/mythdbcon.h: No such file or directory
 actionset.h:209: error: ISO C++ forbids declaration of ‚QMap‚ with no type
 actionset.h:209: error: expected ‚;‚ before ‚<‚ token
 keybindings.cpp: In member function ‚void KeyBindings::commitAction(const
 ActionID&)‚:
 keybindings.cpp:107: error: ‚MSqlQuery‚ was not declared in this scope
 keybindings.cpp:107: error: expected `;' before ‚query‚
 keybindings.cpp:108: error: ‚query‚ was not declared in this scope
 keybindings.cpp:124: error: ‚gContext‚ was not declared in this scope
 keybindings.cpp: In member function ‚void
 KeyBindings::commitJumppoint(const ActionID&)‚:
 keybindings.cpp:137: error: ‚MSqlQuery‚ was not declared in this scope
 keybindings.cpp:137: error: expected `;' before ‚query‚
 keybindings.cpp:138: error: ‚query‚ was not declared in this scope
 keybindings.cpp:154: error: ‚gContext‚ was not declared in this scope
 keybindings.cpp: In member function ‚void
 KeyBindings::retrieveJumppoints()‚:
 keybindings.cpp:187: error: ‚MSqlQuery‚ was not declared in this scope
 keybindings.cpp:187: error: expected `;' before ‚query‚
 keybindings.cpp:189: error: ‚query‚ was not declared in this scope
 keybindings.cpp:198: error: ‚query‚ was not declared in this scope
 keybindings.cpp: In member function ‚void
 KeyBindings::retrieveContexts()‚:
 keybindings.cpp:219: error: ‚MSqlQuery‚ was not declared in this scope
 keybindings.cpp:219: error: expected `;' before ‚query‚
 keybindings.cpp:221: error: ‚query‚ was not declared in this scope
 keybindings.cpp:231: error: ‚query‚ was not declared in this scope
 make[2]: *** [keybindings.o] Error 1
 make[2]: Leaving directory
 `/usr/src/mythplugins/mythcontrols/mythcontrols'
 make[1]: *** [sub-mythcontrols] Error 2
 make[1]: Leaving directory `/usr/src/mythplugins/mythcontrols'
 make: *** [sub-mythcontrols] Error 2

-- 
Ticket URL: <http://svn.mythtv.org/trac/ticket/1785>
MythTV <http://www.mythtv.org/>
MythTV


More information about the mythtv-commits mailing list