[mythtv] Compile Problem

Jim Duda jim.duda at rcn.com
Thu Jan 1 12:08:08 EST 2004


I posted this on the users list, but didn't get a response,
hoping to get some help from the developers.

I'm getting this compile error compiling from source.
qt3.3 is installed.

linux# echo $QTDIR
/usr/local/qt

qt -> qt-x11-free-3.3.0b1

I'm running linux 2.4.22

make[2]: Entering directory `/usr/src/mythtv-0.12/libs/libmyth'
g++ -c -pipe -Wall -W -O3 -march=pentiumpro -fomit-frame-pointer 
-D_REENTRANT -fPIC  -D_GNU_SOURCE -D_FILE_OFFSET_BITS=64 
-DPREFIX=\"/usr/local\" -DMMX -DQT_NO_DEBUG -DQT_THREAD_SUPPORT -DQT_SHARED 
-I/usr/local/qt/mkspecs/default -I. -I../../../../local/include 
-I/usr/local/qt/include -o audiooutput.o audiooutput.cpp
In file included from audiooutput.cpp:7:
audiooutputoss.h:84: field `audiotime_updated' has incomplete type
make[2]: *** [audiooutput.o] Error 1
make[2]: Leaving directory `/usr/src/mythtv-0.12/libs/libmyth'
make[1]: *** [sub-libmyth] Error 2
make[1]: Leaving directory `/usr/src/mythtv-0.12/libs'
make: *** [sub-libs] Error 2
linux#

Can anyone offer any help?

Jim


More information about the mythtv-dev mailing list