[mythtv] Music for image gallery?

Robert Stanford rob at rotapile.com
Mon Mar 22 06:47:02 EST 2004


Oscar Carlsson wrote:

>first? Try
>searching the archives or even, big "oooooh", check CVS.
>  
>
Last built cvs on the 20th, can't see anything relating to this thread.

Just updated cvs and tried building mythmusic, ended up with

make
cd mythmusic && make -f Makefile
make[1]: Entering directory `/usr/src/cvs/mythtv/mythmusic/mythmusic'
g++ -c -pipe -Wall -W -O3 -march=pentiumpro -fomit-frame-pointer 
-I/usr/include/SDL -D_REENTRANT -D_REENTRANT -fPIC  -D_GNU_SOURCE 
-DPREFIX=\"/usr/local\" -DQT_NO_DEBUG -DQT_THREAD_SUPPORT -DQT_PLUGIN 
-DQT_SHARED -I/usr/share/qt3/mkspecs/default -I. 
-I../../../../../local/include -I/usr/include/cdda 
-I../../../../../include/qt3 -I../../../../../X11R6/include -o 
cddecoder.o cddecoder.cpp
In file included from metadata.h:10,
                 from cddecoder.cpp:16:
treecheckitem.h:12: error: parse error before `{' token
treecheckitem.h:16: error: destructors must be member functions
treecheckitem.h:16: error: virtual outside class declaration
treecheckitem.h: In function `QString getLevel()':
treecheckitem.h:18: error: `m_level' undeclared (first use this function)
treecheckitem.h:18: error: (Each undeclared identifier is reported only once
   for each function it appears in.)
treecheckitem.h: In function `int getID()':
treecheckitem.h:19: error: `m_id' undeclared (first use this function)
treecheckitem.h: In function `bool isCheckable()':
treecheckitem.h:22: error: `m_checkable' undeclared (first use this 
function)
treecheckitem.h: At global scope:
treecheckitem.h:26: error: parse error before `private'
treecheckitem.h:29: error: `int m_id' used prior to declaration
treecheckitem.h:30: error: `QString m_level' used prior to declaration
treecheckitem.h:31: error: `bool m_checkable' used prior to declaration
treecheckitem.h:32: error: parse error before `}' token
treecheckitem.h:35: error: base class `TreeCheckItem' has incomplete type
treecheckitem.h:37: error: parse error before `*' token
treecheckitem.h:42: error: parse error before `{' token
treecheckitem.h:46: error: virtual outside class declaration
treecheckitem.h:46: error: function `void userSelectedMe()' is 
initialized like
   a variable
treecheckitem.h: In function `QString getText()':
treecheckitem.h:48: error: `text' undeclared (first use this function)
treecheckitem.h: At global scope:
treecheckitem.h:50: error: parse error before `private'
treecheckitem.h:55: error: base class `PlaylistItem' has incomplete type
treecheckitem.h:57: error: parse error before `*' token
treecheckitem.h:70: error: base class `PlaylistItem' has incomplete type
treecheckitem.h:72: error: parse error before `*' token
treecheckitem.h:89: error: parse error before `*' token
treecheckitem.h:95: error: parse error before `*' token
In file included from cddecoder.cpp:16:
metadata.h:148: error: `parent' was not declared in this scope
metadata.h:148: error: parse error before `)' token
metadata.h:218: error: `where' was not declared in this scope
metadata.h:218: error: parse error before `)' token
make[1]: *** [cddecoder.o] Error 1
make[1]: Leaving directory `/usr/src/cvs/mythtv/mythmusic/mythmusic'
make: *** [sub-mythmusic] Error 2



Instead of being a smarty why not get to the point!

-- 
,,`,,
   Robert Stanford 
`,,`




More information about the mythtv-dev mailing list