[mythtv] OSX build problem on 15515

Stuart Auchterlonie stuarta at squashedfrog.net
Mon Jan 21 12:43:50 UTC 2008


Anyone else having problems building on OSX?

I'm getting the following


Stuart

----
building libmythui

ld: Undefined symbols:
__ZN11AppleRemote11setListenerEPNS_8ListenerE
__ZN11AppleRemote13stopListeningEv
__ZN11AppleRemote14startListeningEv
__ZN11AppleRemote19isListeningToRemoteEv
__ZN11AppleRemote7runLoopEv
__ZN11AppleRemote8instanceEv
__ZN11MythContext10GetSettingERK7QStringS2_
__ZN11MythContext11GetHostNameEv
__ZN11MythContext11ThemeWidgetEP7QWidget
__ZN11MythContext13GetMediumFontEv
__ZN11MythContext13GetNumSettingERK7QStringi
__ZN11MythContext13verbose_mutexE
__ZN11MythContext16ResetScreensaverEv
__ZN11MythContext17GetScreenIsAsleepEv
__ZN11MythContext17GetScreenSettingsERiS0_RfS0_S0_S1_
__ZN11MythContext18DoResetScreensaverEv
__ZN11MythContext20DoDisableScreensaverEv
__ZN11MythContext20DoRestoreScreensaverEv
__ZN11MythContext7DBErrorERK7QStringRK9QSqlQuery
__ZN12MediaMonitor15GetMediaMonitorEv
__ZN12MediaMonitor15ValidateAndLockEP15MythMediaDevice
__ZN12MediaMonitor25MonitorRegisterExtensionsEjRK7QString
__ZN12MediaMonitor6UnlockEP15MythMediaDevice
__ZN15MythMediaDevice15MediaTypeStringE9MediaType
__ZN19AppleRemoteListenerC1EP7QObject
__ZN9MSqlQuery7InitConEv
__ZN9MSqlQuery7prepareERK7QString
__ZN9MSqlQueryC1ERK14_MSqlQueryInfo
__ZN9MSqlQueryD1Ev
__ZTI10MythDialog
_gContext
_print_verbose_messages
__ZN11MythContext14LoadScaleImageE7QStringb
__ZN11MythContext11GetThemeDirEv
__ZN11MythContext8qtconfigEv
__ZN8Settings10GetSettingE7QStringS0_
__ZN11MythContext18GetThemeSearchPathEv
__ZN11MythContext11GetLanguageEv
__ZN11MythContext21GetLanguageAndVariantEv
_globalFontMap
__Z10myth_ejectv
__Z11myth_systemRK7QStringi
__ZN10MythDialog4execEv
__ZN11MythContext10FindPluginERK7QString
__ZN11MythContext10GetConfDirEv
__ZN11MythContext10SetSettingERK7QStringS2_
__ZN11MythContext11GetShareDirEv
__ZN11MythContext11SaveSettingERK7QStringS2_
__ZN11MythContext13GetMainWindowEv
__ZN11MythContext15GetMenuThemeDirEv
__ZN11MythContext16getPluginManagerEv
__ZN11MythContext21SendReceiveStringListER11QStringListbb
__ZN17MythPluginManager10run_pluginERK7QString
__ZN17MythPluginManager13config_pluginERK7QString
__ZN18MythPasswordDialogC1E7QStringPbS0_P14MythMainWindowPKcb
__ZN3LCD12switchToMenuEP8QPtrListI11LCDMenuItemE7QStringb
__ZN3LCD12switchToTimeEv
__ZN3LCD3GetEv
/usr/bin/libtool: internal link edit command failed
make[2]: *** [libmythui-0.20.0.20.0.dylib] Error 1
make[1]: *** [sub-libmythui] Error 2
make: *** [sub-libs] Error 2
[osx-pkg] Failed system call: " /usr/bin/make -j2 " with error code 2
Died at ./osx-packager.pl line 1002.



More information about the mythtv-dev mailing list