[mythtv] MacOS - FFmpeg compile failure

Craig Treleaven ctreleaven at cogeco.ca
Sun Dec 19 18:01:04 UTC 2010


Hi:

ffmpeg won't compile .24-fixes (pulled today from GIT) under Mac OS X 
10.5.8.  osx-packager gets to ffmpeg and fails as follows:

ffmpeg.c: In function 'getmaxrss':
ffmpeg.c:3845: error: 'struct rusage' has no member named 'ru_maxrss'
make[1]: *** [ffmpeg.o] Error 1
make[1]: *** Waiting for unfinished jobs....
make: *** [external/FFmpeg] Error 2
[osx-pkg] Failed system call: " /usr/bin/make -j3 " with error code 2
Died at osx-packager.pl line 1017.

I've tried doing a distclean, etc.

Is this related to the recent change to mythffmpeg?

Craig


More information about the mythtv-dev mailing list