[mythtv-users] Compiling MythTV 0.19 fixes

Joacim J jocke4news at gmail.com
Wed Aug 9 21:31:21 UTC 2006


Hi again,

I tried to compile (even if I haven't got the configuration 100% yet) but
gets some errors. Do you have any idea on this?

vsync.cpp: In destructor ‚virtual OpenGLVideoSync::~OpenGLVideoSync()‚:
vsync.cpp:449: error: ‚VideoOutputXv‚ was not declared in this scope
vsync.cpp:449: error: ‚vo‚ was not declared in this scope
vsync.cpp:449: error: expected type-specifier before ‚VideoOutputXv‚
vsync.cpp:449: error: expected `>' before ‚VideoOutputXv‚
vsync.cpp:449: error: expected `(' before ‚VideoOutputXv‚
vsync.cpp:449: error: expected primary-expression before ‚>‚ token
vsync.cpp:449: error: expected `)' before ‚;‚ token
vsync.cpp: In member function ‚virtual bool OpenGLVideoSync::TryInit()‚:
vsync.cpp:468: error: ‚VideoOutputXv‚ was not declared in this scope
vsync.cpp:468: error: ‚vo‚ was not declared in this scope
vsync.cpp:468: error: expected type-specifier before ‚VideoOutputXv‚
vsync.cpp:468: error: expected `>' before ‚VideoOutputXv‚
vsync.cpp:468: error: expected `(' before ‚VideoOutputXv‚
vsync.cpp:468: error: expected primary-expression before ‚>‚ token
vsync.cpp:468: error: expected `)' before ‚;‚ token
vsync.cpp: In member function ‚virtual void OpenGLVideoSync::Start()‚:
vsync.cpp:616: error: ‚VideoOutputXv‚ was not declared in this scope
vsync.cpp:616: error: ‚vo‚ was not declared in this scope
vsync.cpp:616: error: expected type-specifier before ‚VideoOutputXv‚
vsync.cpp:616: error: expected `>' before ‚VideoOutputXv‚
vsync.cpp:616: error: expected `(' before ‚VideoOutputXv‚
vsync.cpp:616: error: expected primary-expression before ‚>‚ token
vsync.cpp:616: error: expected `)' before ‚;‚ token
vsync.cpp: In member function ‚virtual void OpenGLVideoSync::Stop()‚:
vsync.cpp:687: error: ‚VideoOutputXv‚ was not declared in this scope
vsync.cpp:687: error: ‚vo‚ was not declared in this scope
vsync.cpp:687: error: expected type-specifier before ‚VideoOutputXv‚
vsync.cpp:687: error: expected `>' before ‚VideoOutputXv‚
vsync.cpp:687: error: expected `(' before ‚VideoOutputXv‚
vsync.cpp:687: error: expected primary-expression before ‚>‚ token
vsync.cpp:687: error: expected `)' before ‚;‚ token
make[2]: *** [vsync.o] Error 1
make[2]: Leaving directory `/home/mythtv/mythtv_src/mythtv/libs/libmythtv'
make[1]: *** [sub-libmythtv] Error 2
make[1]: Leaving directory `/home/mythtv/mythtv_src/mythtv/libs'
make: *** [sub-libs] Error 2
[mythtv at htpc mythtv]$


BR
Jocke

On 8/9/06, Joacim J <jocke4news at gmail.com> wrote:
>
> Yes, I could understand that libdca is needed from the configure script
> and I quote my first message in this thread:
> "I am trying to compile MythTV on Fedora Core 5 but can not configure "DTS
> Passthrough" and "DVD Playback". I have installed libdca, libdvdnav and
> libdvdnav-devel among other libs. Can still not get it set. The result is:
> ..."
>
> I have installed it with yum.
> Still no luck on this issue(s)...
>
> // Joacim
>
>
>
> On 8/9/06, William < wmunson at rochester.rr.com> wrote:
>
> >  He is correct its libdca not the one in the last message.
> >
>
> _______________________________________________
> mythtv-users mailing list
> mythtv-users at mythtv.org
> http://mythtv.org/cgi-bin/mailman/listinfo/mythtv-users
>
>
>
>
>
> --
> Regards
> Joacim
>



-- 
Regards
Joacim
-------------- next part --------------
An HTML attachment was scrubbed...
URL: http://mythtv.org/pipermail/mythtv-users/attachments/20060809/89c87688/attachment.html 


More information about the mythtv-users mailing list