[mythtv-users] Compiling win32 under Vista fails with segmentation fault

Michel Meyers steltek at tcnnet.com
Thu Jun 25 09:31:02 UTC 2009


-----BEGIN PGP SIGNED MESSAGE-----
Hash: SHA1

Hello,

I'm just wondering if anybody else has this issue. I'm trying to compile
the win32 build under Windows Vista (32-bit) and it keeps failing to
compile QT:

g++ -c -include tmp\obj\debug_shared\qt_pch.h -g -Wall -frtti
- -fexceptions -mthreads -DQT_SHARED -DQT_THREAD_SUPPORT -DUNICODE
- -DQT_LARGEFILE_SUPPORT -DQT_BUILD_CORE_LIB -DQT_NO_USING_NAMESPACE
- -DQT_MAKEDLL -DQT_ASCII_CAST_WARNINGS -DQT3_SUPPORT -DQT_MOC_COMPAT
- -D_USE_MATH_DEFINES -DHB_EXPORT=Q_CORE_EXPORT -DQT_DLL -I"..\..\include"
- -I"..\..\include\QtCore" -I"tmp\rcc\debug_shared" -I"tmp" -I"concurrent"
- -I"global" -I"..\3rdparty\zlib" -I"..\3rdparty\harfbuzz\src"
- -I"c:\MSys\1.0\qt-win-opensource-src-4.4.3\include\ActiveQt"
- -I"tmp\moc\debug_shared" -I"." -I"..\..\mkspecs\win32-g++" -o
tmp\obj\debug_shared\qwindowspipewriter.o io\qwindowspipewriter.cpp
g++ -c -include tmp\obj\debug_shared\qt_pch.h -g -Wall -frtti
- -fexceptions -mthreads -DQT_SHARED -DQT_THREAD_SUPPORT -DUNICODE
- -DQT_LARGEFILE_SUPPORT -DQT_BUILD_CORE_LIB -DQT_NO_USING_NAMESPACE
- -DQT_MAKEDLL -DQT_ASCII_CAST_WARNINGS -DQT3_SUPPORT -DQT_MOC_COMPAT
- -D_USE_MATH_DEFINES -DHB_EXPORT=Q_CORE_EXPORT -DQT_DLL -I"..\..\include"
- -I"..\..\include\QtCore" -I"tmp\rcc\debug_shared" -I"tmp" -I"concurrent"
- -I"global" -I"..\3rdparty\zlib" -I"..\3rdparty\harfbuzz\src"
- -I"c:\MSys\1.0\qt-win-opensource-src-4.4.3\include\ActiveQt"
- -I"tmp\moc\debug_shared" -I"." -I"..\..\mkspecs\win32-g++" -o
tmp\obj\debug_shared\qpluginloader.o plugin\qpluginloader.cpp
plugin\qpluginloader.cpp:364: internal compiler error: Segmentation fault
Please submit a full bug report,
with preprocessed source if appropriate.
See <URL:http://www.mingw.org/bugs.shtml> for instructions.
mingw32-make[3]: *** [tmp/obj/debug_shared/qpluginloader.o] Error 1
mingw32-make[3]: Leaving directory
`C:/MSys/1.0/qt-win-opensource-src-4.4.3/src/
corelib'
mingw32-make[2]: *** [debug-all] Error 2
mingw32-make[2]: Leaving directory
`C:/MSys/1.0/qt-win-opensource-src-4.4.3/src/
corelib'
mingw32-make[1]: *** [all] Error 2
mingw32-make[1]: Leaving directory
`C:/MSys/1.0/qt-win-opensource-src-4.4.3/src/
corelib'
mingw32-make: *** [sub-corelib-make_default-ordered] Error 2

C:\MSys\1.0\qt-win-opensource-src-4.4.3>goto END
EFFECT FAILED (file -> exec): unable to locate expected file
(C:/MSys/1.0/qt-win
- -opensource-src-4.4.3/lib/QtCore4.dll).

Does anybody else experience this issue? (Yes, I know I should probably
report this to the mingw team, but not being a developer, I have a hard
time fulfilling their 'Minimal Self-Contained Test Case' with the
several hundreds of source MBs lingering in these directories.)

I have already tried the current, previous and candidate releases of
Mingw, they all bail out at the same spot. Any ideas or suggestions on
how to debug or fix this would be greatly appreciated.

Greetings,
        Michel
-----BEGIN PGP SIGNATURE-----
Version: GnuPG v1.4.9 (MingW32)

iEYEARECAAYFAkpDQ9YACgkQ2Vs+MkscAyUX0gCgolZbzQFrfBScFMy0jO10yAwS
Xy0AoMjZwcbaY2GIK08kaTgUoOCmwn0O
=wHCz
-----END PGP SIGNATURE-----



More information about the mythtv-users mailing list